Reaction Details
TargetCalcium/calmodulin-dependent protein kinase type 1D
LigandBDBM31090
Substrate/Competitorn/a
Meas. Tech.ChEMBL_325025 (CHEMBL860659)
Kd 3800±n/a nM
Citation Fabian, MABiggs, WHTreiber, DKAtteridge, CEAzimioara, MDBenedetti, MGCarter, TACiceri, PEdeen, PTFloyd, MFord, JMGalvin, MGerlach, JLGrotzfeld, RMHerrgard, SInsko, DEInsko, MALai, AGLélias, JMMehta, SAMilanov, ZVVelasco, AMWodicka, LMPatel, HKZarrinkar, PPLockhart, DJ A small molecule-kinase interaction map for clinical kinase inhibitors. Nat Biotechnol23:329-36 (2005) 
 
Calcium/calmodulin-dependent protein kinase type 1D
Name:Calcium/calmodulin-dependent protein kinase type 1D
Type:PROTEIN
Mol. Mass.:42916.83
Organism:Homo sapiens (Human)
Description:ChEMBL_586559
Residue:385
BDBM31090
NameBDBM31090
Synonyms:(E)-N-[4-(3-chloro-4-fluoro-anilino)-3-cyano-7-ethoxy-6-quinolyl]-4-(dimethylamino)but-2-enamide (E)-N-[4-(3-chloro-4-fluoroanilino)-3-cyano-7-ethoxyquinolin-6-yl]-4-(dimethylamino)but-2-enamide EKB-569 cid_6445562
TypeSmall organic molecule
Emp. Form.C24H23ClFN5O2
Mol. Mass.467.923
SMILESCCOc1cc2ncc(C#N)c(Nc3ccc(F)c(Cl)c3)c2cc1NC(=O)\C=C\CN(C)C