Reaction Details
TargetKappa-type opioid receptor
LigandBDBM50161316
Substrate/Competitorn/a
Meas. Tech.ChEMBL_310602 (CHEMBL837181)
EC50 4.37±n/a nM
Citation Kumar, VGuo, DDaubert, JDCassel, JADeHaven, RNMansson, EDeHaven-Hudkins, DLMaycock, AL Amino acid conjugates as kappa opioid receptor agonists. Bioorg Med Chem Lett15:1279-82 (2005) 
 
Kappa-type opioid receptor
Name:Kappa-type opioid receptor
Type:G Protein-Coupled Receptor (GPCR)
Mol. Mass.:42648.76
Organism:Homo sapiens (Human)
Description:P41145
Residue:380
BDBM50161316
NameBDBM50161316
Synonyms:1-Oxy-benzo[1,2,5]oxadiazole-5-carboxylic acid {[methyl-((S)-1-phenyl-2-pyrrolidin-1-yl-ethyl)-carbamoyl]-methyl}-amide | CHEMBL180598
TypeSmall organic molecule
Emp. Form.C22H25N5O4
Mol. Mass.423.465
SMILESCN([C@H](CN1CCCC1)c1ccccc1)C(=O)CNC(=O)c1ccc2[n+]([O-])onc2c1