Reaction Details
TargetC-C chemokine receptor type 3
LigandBDBM50161407
Substrate/Competitorn/a
Meas. Tech.ChEMBL_302656 (CHEMBL839945)
Ki 2981±n/a nM
Citation Ting, PCLee, JFWu, JUmland, SPAslanian, RCao, JDong, YGarlisi, CGGilbert, EJHuang, YJakway, JKelly, JLiu, ZMcCombie, SShah, HTian, FWan, YShih, NY The synthesis of substituted bipiperidine amide compounds as CCR3 antagonists. Bioorg Med Chem Lett15:1375-8 (2005) 
 
C-C chemokine receptor type 3
Name:C-C chemokine receptor type 3
Type:PROTEIN
Mol. Mass.:41648.91
Organism:Rattus norvegicus
Description:ChEMBL_1445730
Residue:359
BDBM50161407
NameBDBM50161407
Synonyms:CHEMBL178447 | [(3S,4S)-4-(3,4-Dichloro-benzyl)-3-hydroxymethyl-[1,4'']bipiperidinyl-1''-yl]-quinolin-6-yl-methanone
TypeSmall organic molecule
Emp. Form.C28H31Cl2N3O2
Mol. Mass.512.471
SMILESOC[C@@H]1CN(CC[C@@H]1Cc1ccc(Cl)c(Cl)c1)C1CCN(CC1)C(=O)c1ccc2ncccc2c1