Reaction Details
TargetC-C chemokine receptor type 3
LigandBDBM50161423
Substrate/Competitorn/a
Meas. Tech.ChEMBL_303259 (CHEMBL826385)
Ki 29±n/a nM
Citation Ting, PCLee, JFWu, JUmland, SPAslanian, RCao, JDong, YGarlisi, CGGilbert, EJHuang, YJakway, JKelly, JLiu, ZMcCombie, SShah, HTian, FWan, YShih, NY The synthesis of substituted bipiperidine amide compounds as CCR3 antagonists. Bioorg Med Chem Lett15:1375-8 (2005) 
 
C-C chemokine receptor type 3
Name:C-C chemokine receptor type 3
Type:Enzyme
Mol. Mass.:41053.88
Organism:Homo sapiens (Human)
Description:P51677
Residue:355
BDBM50161423
NameBDBM50161423
Synonyms:CHEMBL178136 | [(3S,4S)-4-(3,4-Dichloro-benzyl)-3-ethyl-[1,4'']bipiperidinyl-1''-yl]-quinolin-6-yl-methanone
TypeSmall organic molecule
Emp. Form.C29H33Cl2N3O
Mol. Mass.510.498
SMILESCC[C@@H]1CN(CC[C@@H]1Cc1ccc(Cl)c(Cl)c1)C1CCN(CC1)C(=O)c1ccc2ncccc2c1