Reaction Details
TargetC-C chemokine receptor type 3
LigandBDBM50161424
Substrate/Competitorn/a
Meas. Tech.ChEMBL_303259 (CHEMBL826385)
Ki 34±n/a nM
Citation Ting, PCLee, JFWu, JUmland, SPAslanian, RCao, JDong, YGarlisi, CGGilbert, EJHuang, YJakway, JKelly, JLiu, ZMcCombie, SShah, HTian, FWan, YShih, NY The synthesis of substituted bipiperidine amide compounds as CCR3 antagonists. Bioorg Med Chem Lett15:1375-8 (2005) 
 
C-C chemokine receptor type 3
Name:C-C chemokine receptor type 3
Type:Enzyme
Mol. Mass.:41053.88
Organism:Homo sapiens (Human)
Description:P51677
Residue:355
BDBM50161424
NameBDBM50161424
Synonyms:CHEMBL181137 | [(3S,4S)-4-(3,4-Dichloro-benzyl)-3-methoxy-[1,4'']bipiperidinyl-1''-yl]-quinoxalin-2-yl-methanone
TypeSmall organic molecule
Emp. Form.C27H30Cl2N4O2
Mol. Mass.513.459
SMILESCO[C@@H]1CN(CC[C@@H]1Cc1ccc(Cl)c(Cl)c1)C1CCN(CC1)C(=O)c1cnc2ccccc2n1