Reaction Details
TargetC-C chemokine receptor type 3
LigandBDBM50161449
Substrate/Competitorn/a
Meas. Tech.ChEMBL_303259 (CHEMBL826385)
Ki 40±n/a nM
Citation Ting, PCLee, JFWu, JUmland, SPAslanian, RCao, JDong, YGarlisi, CGGilbert, EJHuang, YJakway, JKelly, JLiu, ZMcCombie, SShah, HTian, FWan, YShih, NY The synthesis of substituted bipiperidine amide compounds as CCR3 antagonists. Bioorg Med Chem Lett15:1375-8 (2005) 
 
C-C chemokine receptor type 3
Name:C-C chemokine receptor type 3
Type:Enzyme
Mol. Mass.:41053.88
Organism:Homo sapiens (Human)
Description:P51677
Residue:355
BDBM50161449
NameBDBM50161449
Synonyms:1-[4-(3,4-Dichloro-benzyl)-[1,4'']bipiperidinyl-1''-yl]-2-o-tolyl-ethanone | CHEMBL362700
TypeSmall organic molecule
Emp. Form.C26H32Cl2N2O
Mol. Mass.459.451
SMILESCc1ccccc1CC(=O)N1CCC(CC1)N1CCC(Cc2ccc(Cl)c(Cl)c2)CC1