Reaction Details
TargetFatty-acid amide hydrolase 1
LigandBDBM50161511
Substrate/Competitorn/a
Meas. Tech.ChEMBL_303730 (CHEMBL829636)
Ki 0.56±n/a nM
Citation Leung, DDu, WHardouin, CCheng, HHwang, ICravatt, BFBoger, DL Discovery of an exceptionally potent and selective class of fatty acid amide hydrolase inhibitors enlisting proteome-wide selectivity screening: concurrent optimization of enzyme inhibitor potency and selectivity. Bioorg Med Chem Lett15:1423-8 (2005) 
 
Fatty-acid amide hydrolase 1
Name:Fatty-acid amide hydrolase 1
Type:Hydrolase; single-pass membrane protein; homodimer
Mol. Mass.:63227.28
Organism:Mus musculus (mouse)
Description:Mouse brain membranes were used in the assay.
Residue:579
BDBM50161511
NameBDBM50161511
Synonyms:1-(5-(Furan-2-yl)-1,3,4-oxadiazol-2-yl)-heptan-1-one 1-[5-(furan-2-yl)-1,3,4-oxadiazol-2-yl]-7-phenylheptan-1-one | CHEMBL426967
TypeSmall organic molecule
Emp. Form.C19H20N2O3
Mol. Mass.324.3737
SMILESO=C(CCCCCCc1ccccc1)c1nnc(o1)-c1ccco1