Reaction Details
TargetFatty-acid amide hydrolase 1
LigandBDBM50157120
Substrate/Competitorn/a
Meas. Tech.ChEMBL_303730 (CHEMBL829636)
Ki 3±n/a nM
Citation Leung, DDu, WHardouin, CCheng, HHwang, ICravatt, BFBoger, DL Discovery of an exceptionally potent and selective class of fatty acid amide hydrolase inhibitors enlisting proteome-wide selectivity screening: concurrent optimization of enzyme inhibitor potency and selectivity. Bioorg Med Chem Lett15:1423-8 (2005) 
 
Fatty-acid amide hydrolase 1
Name:Fatty-acid amide hydrolase 1
Type:Hydrolase; single-pass membrane protein; homodimer
Mol. Mass.:63227.28
Organism:Mus musculus (mouse)
Description:Mouse brain membranes were used in the assay.
Residue:579
BDBM50157120
NameBDBM50157120
Synonyms:(9Z)-1-(5-pyridin-2-yl-1,3,4-oxadiazol-2-yl)octadec-9-en-1-one (Z)-1-(5-Pyridin-2-yl-[1,3,4]oxadiazol-2-yl)-octadec-9-en-1-one 1-(5-Pyridin-2-yl-[1,3,4]oxadiazol-2-yl)-octadec-9-en-1-one | CHEMBL178563
TypeSmall organic molecule
Emp. Form.C25H37N3O2
Mol. Mass.411.5802
SMILESCCCCCCCC\C=C/CCCCCCCC(=O)c1nnc(o1)-c1ccccn1