Reaction Details
TargetFatty-acid amide hydrolase 1
LigandBDBM50161513
Substrate/Competitorn/a
Meas. Tech.ChEMBL_303730 (CHEMBL829636)
Ki 0.85±n/a nM
Citation Leung, DDu, WHardouin, CCheng, HHwang, ICravatt, BFBoger, DL Discovery of an exceptionally potent and selective class of fatty acid amide hydrolase inhibitors enlisting proteome-wide selectivity screening: concurrent optimization of enzyme inhibitor potency and selectivity. Bioorg Med Chem Lett15:1423-8 (2005) 
 
Fatty-acid amide hydrolase 1
Name:Fatty-acid amide hydrolase 1
Type:Hydrolase; single-pass membrane protein; homodimer
Mol. Mass.:63227.28
Organism:Mus musculus (mouse)
Description:Mouse brain membranes were used in the assay.
Residue:579
BDBM50161513
NameBDBM50161513
Synonyms:7-Phenyl-1-(5-pyridin-2-yl-[1,3,4]oxadiazol-2-yl)-heptan-1-one CHEMBL361529
TypeSmall organic molecule
Emp. Form.C22H25N3O2
Mol. Mass.363.4528
SMILESO=C(CCCCCCCCc1ccccc1)c1nnc(o1)-c1ccccn1