Reaction Details
TargetCannabinoid receptor 1
LigandBDBM50161556
Substrate/Competitorn/a
Meas. Tech.ChEMBL_304364 (CHEMBL840104)
EC50 500±n/a nM
Citation Plummer, CWFinke, PEMills, SGWang, JTong, XDoss, GAFong, TMLao, JZSchaeffer, MTChen, JShen, CPStribling, DSShearman, LPStrack, AMVan der Ploeg, LH Synthesis and activity of 4,5-diarylimidazoles as human CB1 receptor inverse agonists. Bioorg Med Chem Lett15:1441-6 (2005) 
 
Cannabinoid receptor 1
Name:Cannabinoid receptor 1
Type:G Protein-Coupled Receptor (GPCR)
Mol. Mass.:52868.96
Organism:Homo sapiens (Human)
Description:P21554
Residue:472
BDBM50161556
NameBDBM50161556
Synonyms:4,5-Bis-(4-chloro-phenyl)-1-methyl-1H-imidazole-2-carboxylic acid cyclohexylamide | CHEMBL362679
TypeSmall organic molecule
Emp. Form.C23H23Cl2N3O
Mol. Mass.428.354
SMILESCn1c(nc(c1-c1ccc(Cl)cc1)-c1ccc(Cl)cc1)C(=O)NC1CCCCC1