Reaction Details
TargetCannabinoid receptor 1
LigandBDBM50161563
Substrate/Competitorn/a
Meas. Tech.ChEMBL_306671 (CHEMBL832272)
IC50 16±n/a nM
Citation Plummer, CWFinke, PEMills, SGWang, JTong, XDoss, GAFong, TMLao, JZSchaeffer, MTChen, JShen, CPStribling, DSShearman, LPStrack, AMVan der Ploeg, LH Synthesis and activity of 4,5-diarylimidazoles as human CB1 receptor inverse agonists. Bioorg Med Chem Lett15:1441-6 (2005) 
 
Cannabinoid receptor 1
Name:Cannabinoid receptor 1
Type:G Protein-Coupled Receptor (GPCR)
Mol. Mass.:52868.96
Organism:Homo sapiens (Human)
Description:P21554
Residue:472
BDBM50161563
NameBDBM50161563
Synonyms:4,5-Bis-(2,4-dichloro-phenyl)-1-methyl-1H-imidazole-2-carboxylic acid piperidin-1-ylamide | CHEMBL180144
TypeSmall organic molecule
Emp. Form.C22H20Cl4N4O
Mol. Mass.498.232
SMILESCn1c(nc(c1-c1ccc(Cl)cc1Cl)-c1ccc(Cl)cc1Cl)C(=O)NN1CCCCC1