Reaction Details
TargetCannabinoid receptor 1
LigandBDBM50161577
Substrate/Competitorn/a
Meas. Tech.ChEMBL_306671 (CHEMBL832272)
IC50 1100±n/a nM
Citation Plummer, CWFinke, PEMills, SGWang, JTong, XDoss, GAFong, TMLao, JZSchaeffer, MTChen, JShen, CPStribling, DSShearman, LPStrack, AMVan der Ploeg, LH Synthesis and activity of 4,5-diarylimidazoles as human CB1 receptor inverse agonists. Bioorg Med Chem Lett15:1441-6 (2005) 
 
Cannabinoid receptor 1
Name:Cannabinoid receptor 1
Type:G Protein-Coupled Receptor (GPCR)
Mol. Mass.:52868.96
Organism:Homo sapiens (Human)
Description:P21554
Residue:472
BDBM50161577
NameBDBM50161577
Synonyms:CHEMBL180949 | xvx4,5-Bis-(4-chloro-phenyl)-1-methyl-1H-imidazole-2-carboxylic acid morpholin-4-ylamide[4,5-Bis-(4-chloro-phenyl)-1-methyl-1H-imidazol-24,5-Bis-(4-chloro-phenyl)-1-methyl-1H-imidazole-2-carboxylic acid morpholin-4-ylamide-yl]-piperidin-1-yl-methanone
TypeSmall organic molecule
Emp. Form.C22H21Cl2N3O
Mol. Mass.414.328
SMILESCn1c(nc(c1-c1ccc(Cl)cc1)-c1ccc(Cl)cc1)C(=O)N1CCCCC1