Reaction Details
TargetCannabinoid receptor 1
LigandBDBM50161578
Substrate/Competitorn/a
Meas. Tech.ChEMBL_306671 (CHEMBL832272)
IC50 470±n/a nM
Citation Plummer, CWFinke, PEMills, SGWang, JTong, XDoss, GAFong, TMLao, JZSchaeffer, MTChen, JShen, CPStribling, DSShearman, LPStrack, AMVan der Ploeg, LH Synthesis and activity of 4,5-diarylimidazoles as human CB1 receptor inverse agonists. Bioorg Med Chem Lett15:1441-6 (2005) 
 
Cannabinoid receptor 1
Name:Cannabinoid receptor 1
Type:G Protein-Coupled Receptor (GPCR)
Mol. Mass.:52868.96
Organism:Homo sapiens (Human)
Description:P21554
Residue:472
BDBM50161578
NameBDBM50161578
Synonyms:4-(4-Chloro-phenyl)-5-(2,4-dichloro-phenyl)-oxazole-2-carboxylic acid piperidin-1-ylamide | CHEMBL181305
TypeSmall organic molecule
Emp. Form.C21H18Cl3N3O2
Mol. Mass.450.746
SMILESClc1ccc(cc1)-c1nc(oc1-c1ccc(Cl)cc1Cl)C(=O)NN1CCCCC1