Reaction Details
TargetCannabinoid receptor 1
LigandBDBM50161584
Substrate/Competitorn/a
Meas. Tech.ChEMBL_306671 (CHEMBL832272)
IC50 900±n/a nM
Citation Plummer, CWFinke, PEMills, SGWang, JTong, XDoss, GAFong, TMLao, JZSchaeffer, MTChen, JShen, CPStribling, DSShearman, LPStrack, AMVan der Ploeg, LH Synthesis and activity of 4,5-diarylimidazoles as human CB1 receptor inverse agonists. Bioorg Med Chem Lett15:1441-6 (2005) 
 
Cannabinoid receptor 1
Name:Cannabinoid receptor 1
Type:G Protein-Coupled Receptor (GPCR)
Mol. Mass.:52868.96
Organism:Homo sapiens (Human)
Description:P21554
Residue:472
BDBM50161584
NameBDBM50161584
Synonyms:1-Methyl-4,5-di-p-tolyl-1H-imidazole-2-carboxylic acid cyclohexylamide | CHEMBL181269
TypeSmall organic molecule
Emp. Form.C25H29N3O
Mol. Mass.387.5173
SMILESCc1ccc(cc1)-c1nc(C(=O)NC2CCCCC2)n(C)c1-c1ccc(C)cc1