Reaction Details
TargetHeme oxygenase 1
LigandBDBM31655
Substrate/Competitorn/a
Meas. Tech.ChEMBL_305810 (CHEMBL829463)
IC50 1600±n/a nM
Citation Vlahakis, JZKinobe, RTBowers, RJBrien, JFNakatsu, KSzarek, WA Synthesis and evaluation of azalanstat analogues as heme oxygenase inhibitors. Bioorg Med Chem Lett15:1457-61 (2005) 
 
Heme oxygenase 1
Name:Heme oxygenase 1
Type:Enzyme
Mol. Mass.:33005.15
Organism:Rattus norvegicus (rat)
Description:HO-1 obtained from rat spleen was used in enzyme assays.
Residue:289
BDBM31655
NameBDBM31655
Synonyms:CHEMBL179494 | imidazole-dioxolane, 7
TypeSmall organic molecule
Emp. Form.C22H24ClN3O2S
Mol. Mass.429.963
SMILESNc1cccc(SC[C@@H]2CO[C@@](CCc3ccc(Cl)cc3)(Cn3ccnc3)O2)c1