Reaction Details
TargetHeme oxygenase 2
LigandBDBM31653
Substrate/Competitorn/a
Meas. Tech.ChEMBL_305775 (CHEMBL827964)
IC50 5000±n/a nM
Citation Vlahakis, JZKinobe, RTBowers, RJBrien, JFNakatsu, KSzarek, WA Synthesis and evaluation of azalanstat analogues as heme oxygenase inhibitors. Bioorg Med Chem Lett15:1457-61 (2005) 
 
Heme oxygenase 2
Name:Heme oxygenase 2
Type:Enzyme
Mol. Mass.:35754.99
Organism:Rattus norvegicus (rat)
Description:HO-2 obtained from rat brain was used in enzyme assays.
Residue:315
BDBM31653
NameBDBM31653
Synonyms:CHEMBL421109 | imidazole-dioxolane, 5
TypeSmall organic molecule
Emp. Form.C22H24ClN3O2S
Mol. Mass.429.963
SMILESNc1ccc(SC[C@@H]2CO[C@@](CCc3ccc(Cl)cc3)(Cn3ccnc3)O2)cc1