Reaction Details
TargetPeroxisome proliferator-activated receptor alpha
LigandBDBM24566
Substrate/Competitorn/a
Meas. Tech.ChEMBL_304215 (CHEMBL829755)
EC50 29000±n/a nM
Citation Sauerberg, PMogensen, JPJeppesen, LSvensson, LAFleckner, JNehlin, JWulff, EMPettersson, I Structure-activity relationships of dimeric PPAR agonists. Bioorg Med Chem Lett15:1497-500 (2005) 
 
Peroxisome proliferator-activated receptor alpha
Name:Peroxisome proliferator-activated receptor alpha
Type:Enzyme
Mol. Mass.:52222.08
Organism:Homo sapiens (Human)
Description:Q07869
Residue:468
BDBM24566
NameBDBM24566
Synonyms:2-({4-chloro-6-[(2,3-dimethylphenyl)amino]pyrimidin-2-yl}sulfanyl)acetic acid JMC515449 Compound 1 Wyeth 14,643
TypeSmall organic molecule
Emp. Form.C14H14ClN3O2S
Mol. Mass.323.798
SMILESCc1cccc(Nc2cc(Cl)nc(SCC(O)=O)n2)c1C