Reaction Details
TargetHexokinase-4
LigandBDBM50161695
Substrate/Competitorn/a
Meas. Tech.ChEMBL_304261 (CHEMBL829031)
EC50 700±n/a nM
Citation Castelhano, ALDong, HFyfe, MCGardner, LSKamikozawa, YKurabayashi, SNawano, MOhashi, RProcter, MJQiu, LRasamison, CMSchofield, KLShah, VKUeta, KWilliams, GMWitter, DYasuda, K Glucokinase-activating ureas. Bioorg Med Chem Lett15:1501-4 (2005) 
 
Hexokinase-4
Name:Hexokinase-4
Type:PROTEIN
Mol. Mass.:52101.81
Organism:Rattus norvegicus
Description:ChEMBL_1279785
Residue:465
BDBM50161695
NameBDBM50161695
Synonyms:1-(4-Bromo-3-fluoro-phenyl)-3-(5-chloro-thiazol-2-yl)-1-cyclopentylmethyl-urea | CHEMBL541979
TypeSmall organic molecule
Emp. Form.C16H16BrClFN3OS
Mol. Mass.432.738
SMILESFc1cc(ccc1Br)N(CC1CCCC1)C(=O)Nc1ncc(Cl)s1