Reaction Details
TargetEstrogen receptor
LigandBDBM50161709
Substrate/Competitorn/a
Meas. Tech.ChEMBL_305325 (CHEMBL833547)
IC50 2.12±n/a nM
Citation Yang, CXu, GLi, JWu, XLiu, BYan, XWang, MXie, Y Benzothiophenes containing a piperazine side chain as selective ligands for the estrogen receptor alpha and their bioactivities in vivo. Bioorg Med Chem Lett15:1505-7 (2005) 
 
Estrogen receptor
Name:Estrogen receptor
Type:Protein
Mol. Mass.:66230.44
Organism:Homo sapiens (Human)
Description:P03372
Residue:595
BDBM50161709
NameBDBM50161709
Synonyms:CHEMBL182237 | {4-[4-(4,6-Dimethyl-pyrimidin-2-yl)-piperazin-1-yl]-phenyl}-[6-hydroxy-2-(4-hydroxy-phenyl)-benzo[b]thiophen-3-yl]-methanone
TypeSmall organic molecule
Emp. Form.C31H28N4O3S
Mol. Mass.536.644
SMILESCc1cc(C)nc(n1)N1CCN(CC1)c1ccc(cc1)C(=O)c1c(sc2cc(O)ccc12)-c1ccc(O)cc1