Reaction Details
TargetEstrogen receptor
LigandBDBM50161715
Substrate/Competitorn/a
Meas. Tech.ChEMBL_305325 (CHEMBL833547)
IC50 1.43±n/a nM
Citation Yang, CXu, GLi, JWu, XLiu, BYan, XWang, MXie, Y Benzothiophenes containing a piperazine side chain as selective ligands for the estrogen receptor alpha and their bioactivities in vivo. Bioorg Med Chem Lett15:1505-7 (2005) 
 
Estrogen receptor
Name:Estrogen receptor
Type:Protein
Mol. Mass.:66230.44
Organism:Homo sapiens (Human)
Description:P03372
Residue:595
BDBM50161715
NameBDBM50161715
Synonyms:CHEMBL179518 | [6-Hydroxy-2-(4-hydroxy-phenyl)-benzo[b]thiophen-3-yl]-[4-(4-propyl-piperazin-1-yl)-phenyl]-methanone
TypeSmall organic molecule
Emp. Form.C28H28N2O3S
Mol. Mass.472.599
SMILESCCCN1CCN(CC1)c1ccc(cc1)C(=O)c1c(sc2cc(O)ccc12)-c1ccc(O)cc1