Reaction Details
TargetProstaglandin D2 receptor 2
LigandBDBM50161747
Substrate/Competitorn/a
Meas. Tech.ChEMBL_303661 (CHEMBL830422)
Ki 1.9±n/a nM
Citation Ulven, TKostenis, E Minor structural modifications convert the dual TP/CRTH2 antagonist ramatroban into a highly selective and potent CRTH2 antagonist. J Med Chem48:897-900 (2005) 
 
Prostaglandin D2 receptor 2
Name:Prostaglandin D2 receptor 2
Type:Enzyme
Mol. Mass.:43295.45
Organism:Homo sapiens (Human)
Description:Q9Y5Y4
Residue:395
BDBM50161747
NameBDBM50161747
Synonyms:3-{(R)-3-[(4-Fluoro-benzenesulfonyl)-methyl-amino]-1,2,3,4-tetrahydro-carbazol-9-yl}-propionic acid | CHEMBL373118
TypeSmall organic molecule
Emp. Form.C22H23FN2O4S
Mol. Mass.430.492
SMILESCN([C@@H]1CCc2c(C1)c1ccccc1n2CCC(O)=O)S(=O)(=O)c1ccc(F)cc1