Reaction Details
TargetProstaglandin D2 receptor 2
LigandBDBM50161746
Substrate/Competitorn/a
Meas. Tech.ChEMBL_313020 (CHEMBL874214)
IC50 29±n/a nM
Citation Ulven, TKostenis, E Minor structural modifications convert the dual TP/CRTH2 antagonist ramatroban into a highly selective and potent CRTH2 antagonist. J Med Chem48:897-900 (2005) 
 
Prostaglandin D2 receptor 2
Name:Prostaglandin D2 receptor 2
Type:Enzyme
Mol. Mass.:43295.45
Organism:Homo sapiens (Human)
Description:Q9Y5Y4
Residue:395
BDBM50161746
NameBDBM50161746
Synonyms:(R)-3-(3-(4-fluorophenylsulfonamido)-1,2,3,4-tetrahydrocarbazol-9-yl)propanoic acid CHEMBL361812 | RAMATROBAN
TypeSmall organic molecule
Emp. Form.C21H21FN2O4S
Mol. Mass.416.466
SMILESOC(=O)CCn1c2CC[C@H](Cc2c2ccccc12)NS(=O)(=O)c1ccc(F)cc1