Reaction Details
TargetThymidylate synthase
LigandBDBM50161775
Substrate/Competitorn/a
Meas. Tech.ChEMBL_302477 (CHEMBL875209)
Ki 8.5±n/a nM
Citation Tondi, DVenturelli, AFerrari, SGhelli, SCosti, MP Improving specificity vs bacterial thymidylate synthases through N-dansyl modulation of didansyltyrosine. J Med Chem48:913-6 (2005) 
 
Thymidylate synthase
Name:Thymidylate synthase
Type:Enzyme
Mol. Mass.:35718.07
Organism:Homo sapiens (Human)
Description:n/a
Residue:313
BDBM50161775
NameBDBM50161775
Synonyms:(S)-2-(6-Amino-naphthalene-1-sulfonylamino)-3-[4-(5-dimethylamino-naphthalene-1-sulfonyloxy)-phenyl]-propionic acid | CHEMBL360335
TypeSmall organic molecule
Emp. Form.C31H29N3O7S2
Mol. Mass.619.708
SMILESCN(C)c1cccc2c(cccc12)S(=O)(=O)Oc1ccc(C[C@H](NS(=O)(=O)c2cccc3cc(N)ccc23)C(O)=O)cc1