Reaction Details
TargetGonadotropin-releasing hormone receptor
LigandBDBM50162003
Substrate/Competitorn/a
Meas. Tech.ChEMBL_302845 (CHEMBL827890)
Ki 1.8±n/a nM
Citation Tucci, FCZhu, YFStruthers, RSGuo, ZGross, TDRowbottom, MWAcevedo, OGao, YSaunders, JXie, QReinhart, GJLiu, XJLing, NBonneville, AKChen, TBozigian, HChen, C 3-[(2R)-Amino-2-phenylethyl]-1-(2,6-difluorobenzyl)-5-(2-fluoro-3-methoxyphenyl)- 6-methylpyrimidin-2,4-dione (NBI 42902) as a potent and orally active antagonist of the human gonadotropin-releasing hormone receptor. Design, synthesis, and in vitro and in vivo characterization. J Med Chem48:1169-78 (2005) 
 
Gonadotropin-releasing hormone receptor
Name:Gonadotropin-releasing hormone receptor
Type:Enzyme
Mol. Mass.:37749.45
Organism:Homo sapiens (Human)
Description:P30968
Residue:328
BDBM50162003
NameBDBM50162003
Synonyms:1-(2,6-Difluoro-benzyl)-5-(2-fluoro-3-methoxy-phenyl)-6-methyl-3-((R)-2-methylamino-2-phenyl-ethyl)-1H-pyrimidine-2,4-dione | CHEMBL180076
TypeSmall organic molecule
Emp. Form.C28H26F3N3O3
Mol. Mass.509.5195
SMILESCN[C@@H](Cn1c(=O)c(c(C)n(Cc2c(F)cccc2F)c1=O)-c1cccc(OC)c1F)c1ccccc1