Reaction Details
TargetIntegrase
LigandBDBM23398
Substrate/Competitorn/a
Meas. Tech.ChEMBL_305694 (CHEMBL828066)
IC50 20±n/a nM
Citation De Clercq, E New approaches toward anti-HIV chemotherapy. J Med Chem48:1297-313 (2005) 
 
Integrase
Name:Integrase
Synonyms:Human immunodeficiency virus type 1 integrase
Type:PROTEIN
Mol. Mass.:32231.48
Organism:Human immunodeficiency virus 1
Description:ChEMBL_90865
Residue:288
BDBM23398
NameBDBM23398
TypeSmall organic molecule
Emp. Form.C16H12FN3O3
Mol. Mass.313.2832
SMILESFc1ccc(Cc2ccc(o2)C(=O)CC(=O)c2nnc[nH]2)cc1