Reaction Details
TargetRNA-directed RNA polymerase
LigandBDBM50162099
Substrate/Competitorn/a
Meas. Tech.ChEMBL_306530 (CHEMBL829597)
IC50 6±n/a nM
Citation Harper, SPacini, BAvolio, SDi Filippo, MMigliaccio, GLaufer, RDe Francesco, RRowley, MNarjes, F Development and preliminary optimization of indole-N-acetamide inhibitors of hepatitis C virus NS5B polymerase. J Med Chem48:1314-7 (2005) 
 
RNA-directed RNA polymerase
Name:RNA-directed RNA polymerase
Type:Protein
Mol. Mass.:25173.95
Organism:Hepatitis C virus
Description:Q8JXU8
Residue:229
BDBM50162099
NameBDBM50162099
Synonyms:2-(4-Benzyloxy-phenyl)-3-cyclohexyl-1-dimethylcarbamoylmethyl-1H-indole-6-carboxylic acid | CHEMBL369319
TypeSmall organic molecule
Emp. Form.C32H34N2O4
Mol. Mass.510.6234
SMILESCN(C)C(=O)Cn1c(c(C2CCCCC2)c2ccc(cc12)C(O)=O)-c1ccc(OCc2ccccc2)cc1