Reaction Details
TargetVascular endothelial growth factor receptor 2
LigandBDBM50162162
Substrate/Competitorn/a
Meas. Tech.ChEMBL_305183 (CHEMBL876146)
IC50 1.2±n/a nM
Citation Kubo, KShimizu, TOhyama, SMurooka, HIwai, ANakamura, KHasegawa, KKobayashi, YTakahashi, NTakahashi, KKato, SIzawa, TIsoe, T Novel potent orally active selective VEGFR-2 tyrosine kinase inhibitors: synthesis, structure-activity relationships, and antitumor activities of N-phenyl-N'-{4-(4-quinolyloxy)phenyl}ureas. J Med Chem48:1359-66 (2005) 
 
Vascular endothelial growth factor receptor 2
Name:Vascular endothelial growth factor receptor 2
Type:Receptor Tyrosine Kinase
Mol. Mass.:151510.97
Organism:Homo sapiens (Human)
Description:P35968
Residue:1356
BDBM50162162
NameBDBM50162162
Synonyms:1-[4-(6,7-Dimethoxy-quinolin-4-yloxy)-phenyl]-3-(3-fluoro-phenyl)-urea | CHEMBL426602
TypeSmall organic molecule
Emp. Form.C24H20FN3O4
Mol. Mass.433.4317
SMILESCOc1cc2nccc(Oc3ccc(NC(=O)Nc4cccc(F)c4)cc3)c2cc1OC