Reaction Details
TargetVascular endothelial growth factor receptor 2
LigandBDBM50162158
Substrate/Competitorn/a
Meas. Tech.ChEMBL_305183 (CHEMBL876146)
IC50 1.1±n/a nM
Citation Kubo, KShimizu, TOhyama, SMurooka, HIwai, ANakamura, KHasegawa, KKobayashi, YTakahashi, NTakahashi, KKato, SIzawa, TIsoe, T Novel potent orally active selective VEGFR-2 tyrosine kinase inhibitors: synthesis, structure-activity relationships, and antitumor activities of N-phenyl-N'-{4-(4-quinolyloxy)phenyl}ureas. J Med Chem48:1359-66 (2005) 
 
Vascular endothelial growth factor receptor 2
Name:Vascular endothelial growth factor receptor 2
Type:Receptor Tyrosine Kinase
Mol. Mass.:151510.97
Organism:Homo sapiens (Human)
Description:P35968
Residue:1356
BDBM50162158
NameBDBM50162158
Synonyms:1-[4-(6,7-Dimethoxy-quinolin-4-yloxy)-phenyl]-3-(3-nitro-phenyl)-urea | CHEMBL179360
TypeSmall organic molecule
Emp. Form.C24H20N4O6
Mol. Mass.460.4388
SMILESCOc1cc2nccc(Oc3ccc(NC(=O)Nc4cccc(c4)[N+]([O-])=O)cc3)c2cc1OC