Reaction Details
TargetVascular endothelial growth factor receptor 2
LigandBDBM50162160
Substrate/Competitorn/a
Meas. Tech.ChEMBL_305183 (CHEMBL876146)
IC50<1±n/a nM
Citation Kubo, KShimizu, TOhyama, SMurooka, HIwai, ANakamura, KHasegawa, KKobayashi, YTakahashi, NTakahashi, KKato, SIzawa, TIsoe, T Novel potent orally active selective VEGFR-2 tyrosine kinase inhibitors: synthesis, structure-activity relationships, and antitumor activities of N-phenyl-N'-{4-(4-quinolyloxy)phenyl}ureas. J Med Chem48:1359-66 (2005) 
 
Vascular endothelial growth factor receptor 2
Name:Vascular endothelial growth factor receptor 2
Type:Receptor Tyrosine Kinase
Mol. Mass.:151510.97
Organism:Homo sapiens (Human)
Description:P35968
Residue:1356
BDBM50162160
NameBDBM50162160
Synonyms:1-(2,4-Difluoro-phenyl)-3-[4-(6,7-dimethoxy-quinolin-4-yloxy)-3-fluoro-phenyl]-urea CHEMBL179815
TypeSmall organic molecule
Emp. Form.C24H18F3N3O4
Mol. Mass.469.4126
SMILESCOc1cc2nccc(Oc3ccc(NC(=O)Nc4ccc(F)cc4F)cc3F)c2cc1OC