Reaction Details
TargetBifunctional dihydrofolate reductase-thymidylate synthase
LigandBDBM50029766
Substrate/Competitorn/a
Meas. Tech.ChEMBL_305629 (CHEMBL828662)
IC50 0.58±n/a nM
Citation Gangjee, ALin, X CoMFA and CoMSIA analyses of Pneumocystis carinii dihydrofolate reductase, Toxoplasma gondii dihydrofolate reductase, and rat liver dihydrofolate reductase. J Med Chem48:1448-69 (2005) 
 
Bifunctional dihydrofolate reductase-thymidylate synthase
Name:Bifunctional dihydrofolate reductase-thymidylate synthase
Type:Enzyme
Mol. Mass.:68757.49
Organism:Toxoplasma gondii
Description:Q07422
Residue:610
BDBM50029766
NameBDBM50029766
Synonyms:2,4-DIAMINO-5-METHYL-6-[(3,4,5-TRIMETHOXY-N-METHYLANILINO)METHYL]PYRIDO[2,3-D]PYRIMIDINE CHEMBL50514
TypeSmall organic molecule
Emp. Form.C19H24N6O3
Mol. Mass.384.4323
SMILESCOc1cc(cc(OC)c1OC)N(C)Cc1cnc2nc(N)nc(N)c2c1C