Reaction Details
TargetC-C chemokine receptor type 3
LigandBDBM50162346
Substrate/Competitorn/a
Meas. Tech.ChEMBL_303563 (CHEMBL828963)
Ki 80.0±n/a nM
Citation Vedani, ADobler, MDollinger, HHasselbach, KMBirke, FLill, MA Novel ligands for the chemokine receptor-3 (CCR3): a receptor-modeling study based on 5D-QSAR. J Med Chem48:1515-27 (2005) 
 
C-C chemokine receptor type 3
Name:C-C chemokine receptor type 3
Type:Enzyme
Mol. Mass.:41053.88
Organism:Homo sapiens (Human)
Description:P51677
Residue:355
BDBM50162346
NameBDBM50162346
Synonyms:CHEMBL365551 | [2-(4-Cyclohexyl-piperazin-1-yl)-2-phenyl-ethyl]-[2-(3,5-dichloro-phenyl)-ethyl]-amine
TypeSmall organic molecule
Emp. Form.C26H35Cl2N3
Mol. Mass.460.482
SMILESClc1cc(Cl)cc(CCNCC(N2CCN(CC2)C2CCCCC2)c2ccccc2)c1