Reaction Details
TargetC-C chemokine receptor type 3
LigandBDBM50162366
Substrate/Competitorn/a
Meas. Tech.ChEMBL_303563 (CHEMBL828963)
Ki 118±n/a nM
Citation Vedani, ADobler, MDollinger, HHasselbach, KMBirke, FLill, MA Novel ligands for the chemokine receptor-3 (CCR3): a receptor-modeling study based on 5D-QSAR. J Med Chem48:1515-27 (2005) 
 
C-C chemokine receptor type 3
Name:C-C chemokine receptor type 3
Type:Enzyme
Mol. Mass.:41053.88
Organism:Homo sapiens (Human)
Description:P51677
Residue:355
BDBM50162366
NameBDBM50162366
Synonyms:CHEMBL193850 | [2-(4-Cyclohexyl-piperazin-1-yl)-2-(4-trifluoromethyl-phenyl)-ethyl]-[2-(2-methoxy-phenyl)-ethyl]-amine
TypeSmall organic molecule
Emp. Form.C28H38F3N3O
Mol. Mass.489.616
SMILESCOc1ccccc1CCNCC(N1CCN(CC1)C1CCCCC1)c1ccc(cc1)C(F)(F)F