Reaction Details
TargetSerpin H1
LigandBDBM50162504
Substrate/Competitorn/a
Meas. Tech.ChEMBL_305934 (CHEMBL833481)
IC50 26600±n/a nM
Citation Thomson, CAAtkinson, HMAnanthanarayanan, VS Identification of small molecule chemical inhibitors of the collagen-specific chaperone Hsp47. J Med Chem48:1680-4 (2005) 
 
Serpin H1
Name:Serpin H1
Type:PROTEIN
Mol. Mass.:46451.09
Organism:Homo sapiens (Human)
Description:ChEMBL_305934
Residue:418
BDBM50162504
NameBDBM50162504
Synonyms:4-[1-(4-Fluoro-phenyl)-2-nitro-ethylsulfanyl]-phenylamine | CHEMBL383355
TypeSmall organic molecule
Emp. Form.C14H13FN2O2S
Mol. Mass.292.329
SMILESNc1ccc(SC(C[N+]([O-])=O)c2ccc(F)cc2)cc1