Reaction Details
TargetExtracellular calcium-sensing receptor
LigandBDBM50162535
Substrate/Competitorn/a
Meas. Tech.ChEMBL_305795 (CHEMBL827983)
IC50 2800±n/a nM
Citation Shcherbakova, IBalandrin, MFFox, JGhatak, AHeaton, WLConklin, RL 3H-Quinazolin-4-ones as a new calcilytic template for the potential treatment of osteoporosis. Bioorg Med Chem Lett15:1557-60 (2005) 
 
Extracellular calcium-sensing receptor
Name:Extracellular calcium-sensing receptor
Type:Protein
Mol. Mass.:120663.13
Organism:Homo sapiens (Human)
Description:P41180
Residue:1078
BDBM50162535
NameBDBM50162535
Synonyms:2-(3-Hydroxy-phenyl)-3-phenethyl-3H-quinazolin-4-one | CHEMBL179333
TypeSmall organic molecule
Emp. Form.C22H18N2O2
Mol. Mass.342.3905
SMILESOc1cccc(c1)-c1nc2ccccc2c(=O)n1CCc1ccccc1