Reaction Details
TargetExtracellular calcium-sensing receptor
LigandBDBM50162555
Substrate/Competitorn/a
Meas. Tech.ChEMBL_305795 (CHEMBL827983)
IC50 800±n/a nM
Citation Shcherbakova, IBalandrin, MFFox, JGhatak, AHeaton, WLConklin, RL 3H-Quinazolin-4-ones as a new calcilytic template for the potential treatment of osteoporosis. Bioorg Med Chem Lett15:1557-60 (2005) 
 
Extracellular calcium-sensing receptor
Name:Extracellular calcium-sensing receptor
Type:Protein
Mol. Mass.:120663.13
Organism:Homo sapiens (Human)
Description:P41180
Residue:1078
BDBM50162555
NameBDBM50162555
Synonyms:3-[2-(3-Chloro-phenyl)-ethyl]-2-(2-hydroxy-phenyl)-3H-quinazolin-4-one | CHEMBL180250
TypeSmall organic molecule
Emp. Form.C22H17ClN2O2
Mol. Mass.376.836
SMILESOc1ccccc1-c1nc2ccccc2c(=O)n1CCc1cccc(Cl)c1