Reaction Details
TargetMetabotropic glutamate receptor 2
LigandBDBM50162566
Substrate/Competitorn/a
Meas. Tech.ChEMBL_304142 (CHEMBL840258)
EC50 282±n/a nM
Citation Pinkerton, ABCube, RVHutchinson, JHJames, JKGardner, MFRowe, BASchaffhauser, HRodriguez, DECampbell, UCDaggett, LPVernier, JM Allosteric potentiators of the metabotropic glutamate receptor 2 (mGlu2). Part 3: Identification and biological activity of indanone containing mGlu2 receptor potentiators. Bioorg Med Chem Lett15:1565-71 (2005) 
 
Metabotropic glutamate receptor 2
Name:Metabotropic glutamate receptor 2
Type:Enzyme
Mol. Mass.:95584.88
Organism:Homo sapiens (Human)
Description:Q14416
Residue:872
BDBM50162566
NameBDBM50162566
Synonyms:6,7-Dichloro-2-propyl-5-[4-(2H-tetrazol-5-yl)-benzyloxy]-indan-1-one | CHEMBL183541
TypeSmall organic molecule
Emp. Form.C20H18Cl2N4O2
Mol. Mass.417.289
SMILESCCCC1Cc2cc(OCc3ccc(cc3)-c3nnn[nH]3)c(Cl)c(Cl)c2C1=O