Reaction Details
TargetMetabotropic glutamate receptor 2
LigandBDBM50162575
Substrate/Competitorn/a
Meas. Tech.ChEMBL_304142 (CHEMBL840258)
EC50 562.0±n/a nM
Citation Pinkerton, ABCube, RVHutchinson, JHJames, JKGardner, MFRowe, BASchaffhauser, HRodriguez, DECampbell, UCDaggett, LPVernier, JM Allosteric potentiators of the metabotropic glutamate receptor 2 (mGlu2). Part 3: Identification and biological activity of indanone containing mGlu2 receptor potentiators. Bioorg Med Chem Lett15:1565-71 (2005) 
 
Metabotropic glutamate receptor 2
Name:Metabotropic glutamate receptor 2
Type:Enzyme
Mol. Mass.:95584.88
Organism:Homo sapiens (Human)
Description:Q14416
Residue:872
BDBM50162575
NameBDBM50162575
Synonyms:6,7-Dichloro-2-cyclopentyl-2-methyl-5-[3-(pyridin-4-ylsulfanylmethyl)-benzyloxy]-indan-1-one | CHEMBL179876
TypeSmall organic molecule
Emp. Form.C28H27Cl2NO2S
Mol. Mass.512.49
SMILESCC1(Cc2cc(OCc3cccc(CSc4ccncc4)c3)c(Cl)c(Cl)c2C1=O)C1CCCC1