Reaction Details
TargetCytochrome P450 3A4
LigandBDBM50162775
Substrate/Competitorn/a
Meas. Tech.ChEMBL_305432 (CHEMBL830925)
IC50 2032±n/a nM
Citation Mulvihill, MJKan, JLBeck, PBittner, MCesario, CCooke, AKeane, DMNigro, AINillson, CSmith, VSrebernak, MSun, FLVrkljan, MWinski, SLCastelhano, ALEmerson, DGibson, N Potent and selective [2-imidazol-1-yl-2-(6-alkoxy-naphthalen-2-yl)-1-methyl-ethyl]-dimethyl-amines as retinoic acid metabolic blocking agents (RAMBAs). Bioorg Med Chem Lett15:1669-73 (2005) 
 
Cytochrome P450 3A4
Name:Cytochrome P450 3A4
Type:Enzyme
Mol. Mass.:57349.57
Organism:Homo sapiens (Human)
Description:n/a
Residue:503
BDBM50162775
NameBDBM50162775
Synonyms:3-[6-(2-Dimethylamino-1-imidazol-1-yl-propyl)-naphthalen-2-yloxy]-2,2,N,N-tetramethyl-propionamide | CHEMBL367357
TypeSmall organic molecule
Emp. Form.C25H34N4O2
Mol. Mass.422.5631
SMILESCC(C(c1ccc2cc(OCC(C)(C)C(=O)N(C)C)ccc2c1)n1ccnc1)N(C)C