Reaction Details
TargetCytochrome P450 2D6
LigandBDBM50162773
Substrate/Competitorn/a
Meas. Tech.ChEMBL_312056 (CHEMBL834450)
IC50>5000±n/a nM
Citation Mulvihill, MJKan, JLBeck, PBittner, MCesario, CCooke, AKeane, DMNigro, AINillson, CSmith, VSrebernak, MSun, FLVrkljan, MWinski, SLCastelhano, ALEmerson, DGibson, N Potent and selective [2-imidazol-1-yl-2-(6-alkoxy-naphthalen-2-yl)-1-methyl-ethyl]-dimethyl-amines as retinoic acid metabolic blocking agents (RAMBAs). Bioorg Med Chem Lett15:1669-73 (2005) 
 
Cytochrome P450 2D6
Name:Cytochrome P450 2D6
Type:Protein
Mol. Mass.:55774.82
Organism:Homo sapiens (Human)
Description:P10635
Residue:497
BDBM50162773
NameBDBM50162773
Synonyms:3-(6-(2-(dimethylamino)-1-(1H-imidazol-1-yl)propyl)naphthalen-2-yloxy)-2,2-dimethylpropanoic acid CHEMBL360771
TypeSmall organic molecule
Emp. Form.C23H29N3O3
Mol. Mass.395.4947
SMILESCC(C(c1ccc2cc(OCC(C)(C)C(O)=O)ccc2c1)n1ccnc1)N(C)C