Reaction Details
TargetCytochrome P450 26A1
LigandBDBM50162786
Substrate/Competitorn/a
Meas. Tech.ChEMBL_305304 (CHEMBL832851)
IC50 48±n/a nM
Citation Mulvihill, MJKan, JLBeck, PBittner, MCesario, CCooke, AKeane, DMNigro, AINillson, CSmith, VSrebernak, MSun, FLVrkljan, MWinski, SLCastelhano, ALEmerson, DGibson, N Potent and selective [2-imidazol-1-yl-2-(6-alkoxy-naphthalen-2-yl)-1-methyl-ethyl]-dimethyl-amines as retinoic acid metabolic blocking agents (RAMBAs). Bioorg Med Chem Lett15:1669-73 (2005) 
 
Cytochrome P450 26A1
Name:Cytochrome P450 26A1
Type:Enzyme
Mol. Mass.:56216.16
Organism:Homo sapiens (Human)
Description:O43174
Residue:497
BDBM50162786
NameBDBM50162786
Synonyms:3-[6-(2-Dimethylamino-1-imidazol-1-yl-propyl)-naphthalen-2-yloxymethyl]-benzamide | CHEMBL360148
TypeSmall organic molecule
Emp. Form.C26H28N4O2
Mol. Mass.428.5261
SMILESCC(C(c1ccc2cc(OCc3cccc(c3)C(N)=O)ccc2c1)n1ccnc1)N(C)C