Reaction Details
TargetCytochrome P450 26A1
LigandBDBM50162779
Substrate/Competitorn/a
Meas. Tech.ChEMBL_305304 (CHEMBL832851)
IC50 54±n/a nM
Citation Mulvihill, MJKan, JLBeck, PBittner, MCesario, CCooke, AKeane, DMNigro, AINillson, CSmith, VSrebernak, MSun, FLVrkljan, MWinski, SLCastelhano, ALEmerson, DGibson, N Potent and selective [2-imidazol-1-yl-2-(6-alkoxy-naphthalen-2-yl)-1-methyl-ethyl]-dimethyl-amines as retinoic acid metabolic blocking agents (RAMBAs). Bioorg Med Chem Lett15:1669-73 (2005) 
 
Cytochrome P450 26A1
Name:Cytochrome P450 26A1
Type:Enzyme
Mol. Mass.:56216.16
Organism:Homo sapiens (Human)
Description:O43174
Residue:497
BDBM50162779
NameBDBM50162779
Synonyms:3-[6-(2-Dimethylamino-1-imidazol-1-yl-propyl)-naphthalen-2-yloxy]-2,2,N-trimethyl-propionamide | CHEMBL180829
TypeSmall organic molecule
Emp. Form.C24H32N4O2
Mol. Mass.408.5365
SMILESCNC(=O)C(C)(C)COc1ccc2cc(ccc2c1)C(C(C)N(C)C)n1ccnc1