Reaction Details
TargetEstrogen receptor
LigandBDBM50162794
Substrate/Competitorn/a
Meas. Tech.ChEMBL_305467 (CHEMBL831077)
IC50 0.66±n/a nM
Citation Tan, QBlizzard, TAMorgan, JDBirzin, ETChan, WYang, YTPai, LYHayes, ECDaSilva, CAWarrier, SYudkovitz, JWilkinson, HASharma, NFitzgerald, PMLi, SColwell, LFisher, JEAdamski, SReszka, AAKimmel, DDiNinno, FRohrer, SPFreedman, LPSchaeffer, JMHammond, ML Estrogen receptor ligands. Part 10: Chromanes: old scaffolds for new SERAMs. Bioorg Med Chem Lett15:1675-81 (2005) 
 
Estrogen receptor
Name:Estrogen receptor
Type:Protein
Mol. Mass.:66230.44
Organism:Homo sapiens (Human)
Description:P03372
Residue:595
BDBM50162794
NameBDBM50162794
Synonyms:(2R,3R,4S)-3-(4-Hydroxy-phenyl)-4-methyl-2-[4-(2-piperidin-1-yl-ethoxy)-phenyl]-chroman-7-ol | CHEMBL362428
TypeSmall organic molecule
Emp. Form.C29H33NO4
Mol. Mass.459.5766
SMILESC[C@H]1[C@@H]([C@@H](Oc2cc(O)ccc12)c1ccc(OCCN2CCCCC2)cc1)c1ccc(O)cc1