Reaction Details
TargetEstrogen receptor beta
LigandBDBM50162804
Substrate/Competitorn/a
Meas. Tech.ChEMBL_305431 (CHEMBL830924)
IC50 29±n/a nM
Citation Tan, QBlizzard, TAMorgan, JDBirzin, ETChan, WYang, YTPai, LYHayes, ECDaSilva, CAWarrier, SYudkovitz, JWilkinson, HASharma, NFitzgerald, PMLi, SColwell, LFisher, JEAdamski, SReszka, AAKimmel, DDiNinno, FRohrer, SPFreedman, LPSchaeffer, JMHammond, ML Estrogen receptor ligands. Part 10: Chromanes: old scaffolds for new SERAMs. Bioorg Med Chem Lett15:1675-81 (2005) 
 
Estrogen receptor beta
Name:Estrogen receptor beta
Type:Protein
Mol. Mass.:59238.43
Organism:Homo sapiens (Human)
Description:Q92731
Residue:530
BDBM50162804
NameBDBM50162804
Synonyms:(2R,3R,4S)-5-Fluoro-3-(4-hydroxy-phenyl)-4-methyl-2-[4-((S)-2-pyrrolidin-1-yl-propoxy)-phenyl]-chroman-6-ol | CHEMBL359633
TypeSmall organic molecule
Emp. Form.C29H32FNO4
Mol. Mass.477.5671
SMILESC[C@@H](COc1ccc(cc1)[C@@H]1Oc2ccc(O)c(F)c2[C@@H](C)[C@@H]1c1ccc(O)cc1)N1CCCC1