Reaction Details
TargetEstrogen receptor
LigandBDBM50162807
Substrate/Competitorn/a
Meas. Tech.ChEMBL_305467 (CHEMBL831077)
IC50 0.7±n/a nM
Citation Tan, QBlizzard, TAMorgan, JDBirzin, ETChan, WYang, YTPai, LYHayes, ECDaSilva, CAWarrier, SYudkovitz, JWilkinson, HASharma, NFitzgerald, PMLi, SColwell, LFisher, JEAdamski, SReszka, AAKimmel, DDiNinno, FRohrer, SPFreedman, LPSchaeffer, JMHammond, ML Estrogen receptor ligands. Part 10: Chromanes: old scaffolds for new SERAMs. Bioorg Med Chem Lett15:1675-81 (2005) 
 
Estrogen receptor
Name:Estrogen receptor
Type:Protein
Mol. Mass.:66230.44
Organism:Homo sapiens (Human)
Description:P03372
Residue:595
BDBM50162807
NameBDBM50162807
Synonyms:(2R,3R,4S)-5-Fluoro-3-(4-hydroxy-phenyl)-4-methyl-2-{4-[(S)-2-((R)-2-methyl-pyrrolidin-1-yl)-propoxy]-phenyl}-chroman-6-ol | CHEMBL181248
TypeSmall organic molecule
Emp. Form.C30H34FNO4
Mol. Mass.491.5937
SMILESC[C@@H](COc1ccc(cc1)[C@@H]1Oc2ccc(O)c(F)c2[C@@H](C)[C@@H]1c1ccc(O)cc1)N1CCC[C@H]1C