Reaction Details
TargetEstrogen receptor beta
LigandBDBM50162794
Substrate/Competitorn/a
Meas. Tech.ChEMBL_305431 (CHEMBL830924)
IC50 13±n/a nM
Citation Tan, QBlizzard, TAMorgan, JDBirzin, ETChan, WYang, YTPai, LYHayes, ECDaSilva, CAWarrier, SYudkovitz, JWilkinson, HASharma, NFitzgerald, PMLi, SColwell, LFisher, JEAdamski, SReszka, AAKimmel, DDiNinno, FRohrer, SPFreedman, LPSchaeffer, JMHammond, ML Estrogen receptor ligands. Part 10: Chromanes: old scaffolds for new SERAMs. Bioorg Med Chem Lett15:1675-81 (2005) 
 
Estrogen receptor beta
Name:Estrogen receptor beta
Type:Protein
Mol. Mass.:59238.43
Organism:Homo sapiens (Human)
Description:Q92731
Residue:530
BDBM50162794
NameBDBM50162794
Synonyms:(2R,3R,4S)-3-(4-Hydroxy-phenyl)-4-methyl-2-[4-(2-piperidin-1-yl-ethoxy)-phenyl]-chroman-7-ol | CHEMBL362428
TypeSmall organic molecule
Emp. Form.C29H33NO4
Mol. Mass.459.5766
SMILESC[C@H]1[C@@H]([C@@H](Oc2cc(O)ccc12)c1ccc(OCCN2CCCCC2)cc1)c1ccc(O)cc1