Reaction Details
TargetCarbonic anhydrase 4
LigandBDBM50162816
Substrate/Competitorn/a
Meas. Tech.ChEMBL_303009 (CHEMBL830248)
Ki 5340000±n/a nM
Citation Winum, JYInnocenti, AGagnard, VMontero, JLScozzafava, AVullo, DSupuran, CT Carbonic anhydrase inhibitors. Interaction of isozymes I, II, IV, V, and IX with organic phosphates and phosphonates. Bioorg Med Chem Lett15:1683-6 (2005) 
 
Carbonic anhydrase 4
Name:Carbonic anhydrase 4
Type:Enzyme
Mol. Mass.:35037.98
Organism:Homo sapiens (Human)
Description:P22748
Residue:312
BDBM50162816
NameBDBM50162816
Synonyms:CHEMBL180570 Methylene diphsphonate methylenediphosphonic acid
TypeSmall organic molecule
Emp. Form.CH6O6P2
Mol. Mass.176.0023
SMILESOP(O)(=O)CP(O)(O)=O