Reaction Details
TargetCarbonic anhydrase 9
LigandBDBM50011181
Substrate/Competitorn/a
Meas. Tech.ChEMBL_303148 (CHEMBL829122)
Ki 2210000±n/a nM
Citation Winum, JYInnocenti, AGagnard, VMontero, JLScozzafava, AVullo, DSupuran, CT Carbonic anhydrase inhibitors. Interaction of isozymes I, II, IV, V, and IX with organic phosphates and phosphonates. Bioorg Med Chem Lett15:1683-6 (2005) 
 
Carbonic anhydrase 9
Name:Carbonic anhydrase 9
Type:Enzyme
Mol. Mass.:49669.03
Organism:Homo sapiens (Human)
Description:Catalytic domain of human cloned isozyme was used in the assay
Residue:459
BDBM50011181
NameBDBM50011181
Synonyms:(PFA)dihydroxyphosphinecarboxylic acid oxide FOSCARNET Foscarnet (PFA) Phosphono-formic acid(PFA) dihydroxyphosphinecarboxylic acid oxide phosphonoformic acid(PFA)
TypeSmall organic molecule
Emp. Form.CH3O5P
Mol. Mass.126.0053
SMILESOC(=O)P(O)(O)=O