Reaction Details
TargetCarbonic anhydrase 5A, mitochondrial
LigandBDBM50162814
Substrate/Competitorn/a
Meas. Tech.ChEMBL_303126 (CHEMBL828084)
Ki 90000±n/a nM
Citation Winum, JYInnocenti, AGagnard, VMontero, JLScozzafava, AVullo, DSupuran, CT Carbonic anhydrase inhibitors. Interaction of isozymes I, II, IV, V, and IX with organic phosphates and phosphonates. Bioorg Med Chem Lett15:1683-6 (2005) 
 
Carbonic anhydrase 5A, mitochondrial
Name:Carbonic anhydrase 5A, mitochondrial
Type:Enzyme
Mol. Mass.:34755.54
Organism:Homo sapiens (Human)
Description:Human (cloned) isozyme
Residue:305
BDBM50162814
NameBDBM50162814
Synonyms:CHEMBL179801 | Phenyl-phosphonic acid
TypeSmall organic molecule
Emp. Form.C6H7O3P
Mol. Mass.158.0917
SMILESOP(O)(=O)c1ccccc1