Reaction Details
TargetCarbonic anhydrase 4
LigandBDBM50162814
Substrate/Competitorn/a
Meas. Tech.ChEMBL_303009 (CHEMBL830248)
Ki 5400±n/a nM
Citation Winum, JYInnocenti, AGagnard, VMontero, JLScozzafava, AVullo, DSupuran, CT Carbonic anhydrase inhibitors. Interaction of isozymes I, II, IV, V, and IX with organic phosphates and phosphonates. Bioorg Med Chem Lett15:1683-6 (2005) 
 
Carbonic anhydrase 4
Name:Carbonic anhydrase 4
Type:Enzyme
Mol. Mass.:35037.98
Organism:Homo sapiens (Human)
Description:P22748
Residue:312
BDBM50162814
NameBDBM50162814
Synonyms:CHEMBL179801 | Phenyl-phosphonic acid
TypeSmall organic molecule
Emp. Form.C6H7O3P
Mol. Mass.158.0917
SMILESOP(O)(=O)c1ccccc1