Reaction Details
TargetCarbonic anhydrase 5A, mitochondrial
LigandBDBM50162817
Substrate/Competitorn/a
Meas. Tech.ChEMBL_303126 (CHEMBL828084)
Ki 850000.0±n/a nM
Citation Winum, JYInnocenti, AGagnard, VMontero, JLScozzafava, AVullo, DSupuran, CT Carbonic anhydrase inhibitors. Interaction of isozymes I, II, IV, V, and IX with organic phosphates and phosphonates. Bioorg Med Chem Lett15:1683-6 (2005) 
 
Carbonic anhydrase 5A, mitochondrial
Name:Carbonic anhydrase 5A, mitochondrial
Type:Enzyme
Mol. Mass.:34755.54
Organism:Homo sapiens (Human)
Description:Human (cloned) isozyme
Residue:305
BDBM50162817
NameBDBM50162817
Synonyms:2-Amino-3-phosphonooxy-butyric acid | CHEMBL369507
TypeSmall organic molecule
Emp. Form.C4H10NO6P
Mol. Mass.199.0991
SMILESCC(OP(O)(O)=O)C(N)C(O)=O